BDBM50214216 CHEMBL440961::N-(5-((R)-3-((S)-1-(3,4-dimethoxyphenyl)-2-phenylethylamino)-2-hydroxypropyl)-2-hydroxyphenyl)methanesulfonamide
SMILES COc1ccc(cc1OC)[C@H](Cc1ccccc1)NC[C@H](O)Cc1ccc(O)c(NS(C)(=O)=O)c1
InChI Key InChIKey=FAPFLIWIGPTUPT-YADHBBJMSA-N
Data  3 KI
  Tab Delimited (TSV)   2D SDfile   Computed 3D by Vconf -m prep SDfile
Find this compound or compounds like it in BindingDB:
Activity Spreadsheet -- Enzyme Inhibition Constant Data from BindingDB
Found 1 hit for monomerid = 50214216
TargetBeta-1 adrenergic receptor(Homo sapiens (Human))
Bristol-Myers Squibb Pharmaceutical Research Institute
Curated by ChEMBL
LigandPNGBDBM50214216(CHEMBL440961 | N-(5-((R)-3-((S)-1-(3,4-dimethoxyph...)
Affinity DataKi:  4.70E+4nM. Assay description: Displacement of [125I]iodocyanopindolol from human cloned adrenergic beta-1 receptor expressed in CHO cells
In DepthDetails ArticlePubMed